Target
Coagulation factor XI
Ligand
BDBM32679
Substrate
Boc-Glu-Ala-Arg-AMC
Meas. Tech.
Factor XIa Dose Response Confirmation from Single Well Screen
pH
7.4±n/a
Temperature
296.15±n/a K
IC50
>50000±0 nM
Citation
 PubChem, PC Factor XIa Dose Response Confirmation from Single Well Screen PubChem Bioassay (2008)[AID] 
Target
Name:
Coagulation factor XI
Synonyms:
Coagulation factor XIa Coagulation factor XIa light chain FA11_HUMAN Factor XIa PTA | Plasma thromboplastin antecedent
Type:
Enzyme
Mol. Mass.:
70130.58
Organism:
Homo sapiens (Human)
Description:
P03951
Residue:
625
  
Inhibitor
Name:
BDBM32679
Synonyms:
1,3-Dimethyl-10-oxo-10H-9-oxa-4-aza-phenanthrene-2-carboxylic acid ethyl ester 5-keto-2,4-dimethyl-chromeno[4,3-b]pyridine-3-carboxylic acid ethyl ester SMR000118354 ethyl 2,4-dimethyl-5-oxidanylidene-chromeno[4,3-b]pyridine-3-carboxylate | ethyl 2,4-dimethyl-5-oxochromeno[4,3-b]pyridine-3-carboxylate
Type:
Small organic molecule
Emp. Form.:
C17H15NO4
Mol. Mass.:
297.3053
SMILES:
CCOC(=O)c1c(C)nc2c3ccccc3oc(=O)c2c1C
:
Substrate
Name:
Boc-Glu-Ala-Arg-AMC
Synonyms:
Type:
fluorescent substrate peptide
Mol. Mass.:
358.43
Organism:
Description:
Residue:
3
NA