Target
Coagulation factor XI
Ligand
BDBM32729
Substrate
Boc-Glu-Ala-Arg-AMC
Meas. Tech.
Factor XIa Dose Response Confirmation from Single Well Screen
pH
7.4±n/a
Temperature
296.15±n/a K
IC50
3374.08±2130.34 nM
Citation
 PubChem, PC Factor XIa Dose Response Confirmation from Single Well Screen PubChem Bioassay (2008)[AID] 
Target
Name:
Coagulation factor XI
Synonyms:
Coagulation factor XIa Coagulation factor XIa light chain FA11_HUMAN Factor XIa PTA | Plasma thromboplastin antecedent
Type:
Enzyme
Mol. Mass.:
70130.58
Organism:
Homo sapiens (Human)
Description:
P03951
Residue:
625
  
Inhibitor
Name:
BDBM32729
Synonyms:
1-benzoyl-6,6-dimethyl-3-propyl-1,5,6,7-tetrahydro-4H-indazol-4-one 6,6-dimethyl-1-(phenylcarbonyl)-3-propyl-5,7-dihydroindazol-4-one SMR000137200 | cid_788456
Type:
Small organic molecule
Emp. Form.:
C19H22N2O2
Mol. Mass.:
310.3902
SMILES:
CCCc1nn(C(=O)c2ccccc2)c2CC(C)(C)CC(=O)c12
:
Substrate
Name:
Boc-Glu-Ala-Arg-AMC
Synonyms:
Type:
fluorescent substrate peptide
Mol. Mass.:
358.43
Organism:
Description:
Residue:
3
NA