Target
Coagulation factor XI
Ligand
BDBM32756
Substrate
Boc-Glu-Ala-Arg-AMC
Meas. Tech.
Factor XIa 1536 HTS Dose Response Confirmation
pH
7.4±n/a
Temperature
296.15±n/a K
IC50
1661.7±170.4 nM
Citation
 PubChem, PC Factor XIa 1536 HTS Dose Response Confirmation PubChem Bioassay (2008)[AID] 
Target
Name:
Coagulation factor XI
Synonyms:
Coagulation factor XIa Coagulation factor XIa light chain FA11_HUMAN Factor XIa PTA | Plasma thromboplastin antecedent
Type:
Enzyme
Mol. Mass.:
70130.58
Organism:
Homo sapiens (Human)
Description:
P03951
Residue:
625
  
Inhibitor
Name:
BDBM32756
Synonyms:
2-furancarboxylic acid [5-amino-1-(4-fluorophenyl)sulfonyl-3-pyrazolyl] ester Furan-2-carboxylic acid 5-amino-1-(4-fluoro-benzenesulfonyl)-1H-pyrazol-3-yl ester SMR000014918 [5-amino-1-(4-fluorophenyl)sulfonylpyrazol-3-yl] furan-2-carboxylate cid_647599 | furan-2-carboxylic acid [5-amino-1-(4-fluorophenyl)sulfonyl-pyrazol-3-yl] ester
Type:
Small organic molecule
Emp. Form.:
C14H10FN3O5S
Mol. Mass.:
351.31
SMILES:
Nc1cc(OC(=O)c2ccco2)nn1S(=O)(=O)c1ccc(F)cc1
:
Substrate
Name:
Boc-Glu-Ala-Arg-AMC
Synonyms:
Type:
fluorescent substrate peptide
Mol. Mass.:
358.43
Organism:
Description:
Residue:
3
NA