Target
Coagulation factor XI
Ligand
BDBM32805
Substrate
Boc-Glu-Ala-Arg-AMC
Meas. Tech.
Factor XIa 1536 HTS Dose Response Confirmation
pH
7.4±n/a
Temperature
296.15±n/a K
IC50
741.21±30.91027 nM
Citation
 PubChem, PC Factor XIa 1536 HTS Dose Response Confirmation PubChem Bioassay (2008)[AID] 
Target
Name:
Coagulation factor XI
Synonyms:
Coagulation factor XIa Coagulation factor XIa light chain FA11_HUMAN Factor XIa PTA | Plasma thromboplastin antecedent
Type:
Enzyme
Mol. Mass.:
70130.58
Organism:
Homo sapiens (Human)
Description:
P03951
Residue:
625
  
Inhibitor
Name:
BDBM32805
Synonyms:
(5-chloranylpyridin-3-yl) furan-2-carboxylate 2-furancarboxylic acid (5-chloro-3-pyridinyl) ester CHEMBL222840 SMR000114552 cid_7230550 med.21724, Compound 93
Type:
Small organic molecule
Emp. Form.:
C10H6ClNO3
Mol. Mass.:
223.613
SMILES:
Clc1cncc(OC(=O)c2ccco2)c1
:
Substrate
Name:
Boc-Glu-Ala-Arg-AMC
Synonyms:
Type:
fluorescent substrate peptide
Mol. Mass.:
358.43
Organism:
Description:
Residue:
3
NA