Target
Coagulation factor XI
Ligand
BDBM32853
Substrate
Boc-Glu-Ala-Arg-AMC
Meas. Tech.
Factor XIa 1536 HTS Dose Response Confirmation
pH
7.4±n/a
Temperature
296.15±n/a K
IC50
1082.873333±89.160956 nM
Citation
 PubChem, PC Factor XIa 1536 HTS Dose Response Confirmation PubChem Bioassay (2008)[AID] 
Target
Name:
Coagulation factor XI
Synonyms:
Coagulation factor XIa Coagulation factor XIa light chain FA11_HUMAN Factor XIa PTA | Plasma thromboplastin antecedent
Type:
Enzyme
Mol. Mass.:
70130.58
Organism:
Homo sapiens (Human)
Description:
P03951
Residue:
625
  
Inhibitor
Name:
BDBM32853
Synonyms:
(1,3-dioxoisoindol-2-yl) 2,4-dimethylbenzenesulfonate 2,4-dimethylbenzenesulfonic acid phthalimido ester MLS000579570 [1,3-bis(oxidanylidene)isoindol-2-yl] 2,4-dimethylbenzenesulfonate | cid_2196572
Type:
Small organic molecule
Emp. Form.:
C16H13NO5S
Mol. Mass.:
331.343
SMILES:
Cc1ccc(c(C)c1)S(=O)(=O)ON1C(=O)c2ccccc2C1=O
:
Substrate
Name:
Boc-Glu-Ala-Arg-AMC
Synonyms:
Type:
fluorescent substrate peptide
Mol. Mass.:
358.43
Organism:
Description:
Residue:
3
NA