Target
Coagulation factor XI
Ligand
BDBM32934
Substrate
Boc-Glu-Ala-Arg-AMC
Meas. Tech.
Factor XIa 1536 HTS Dose Response Confirmation
pH
7.4±n/a
Temperature
296.15±n/a K
IC50
518.293333±157.940734 nM
Citation
 PubChem, PC Factor XIa 1536 HTS Dose Response Confirmation PubChem Bioassay (2008)[AID] 
Target
Name:
Coagulation factor XI
Synonyms:
Coagulation factor XIa Coagulation factor XIa light chain FA11_HUMAN Factor XIa PTA | Plasma thromboplastin antecedent
Type:
Enzyme
Mol. Mass.:
70130.58
Organism:
Homo sapiens (Human)
Description:
P03951
Residue:
625
  
Inhibitor
Name:
BDBM32934
Synonyms:
MLS000419584 N-([1,3]dioxolo[4,5-f][1,3]benzothiazol-6-yl)-2-furancarboxamide SMR000320301 | cid_7202802
Type:
Small organic molecule
Emp. Form.:
C13H8N2O4S
Mol. Mass.:
288.279
SMILES:
O=C(Nc1nc2cc3OCOc3cc2s1)c1ccco1
:
Substrate
Name:
Boc-Glu-Ala-Arg-AMC
Synonyms:
Type:
fluorescent substrate peptide
Mol. Mass.:
358.43
Organism:
Description:
Residue:
3
NA