Target
Coagulation factor XI
Ligand
BDBM33033
Substrate
Boc-Glu-Ala-Arg-AMC
Meas. Tech.
Factor XIa 1536 HTS Dose Response Confirmation
pH
7.4±n/a
Temperature
296.15±n/a K
IC50
1918.373333±159.912959 nM
Citation
 PubChem, PC Factor XIa 1536 HTS Dose Response Confirmation PubChem Bioassay (2008)[AID] 
Target
Name:
Coagulation factor XI
Synonyms:
Coagulation factor XIa Coagulation factor XIa light chain FA11_HUMAN Factor XIa PTA | Plasma thromboplastin antecedent
Type:
Enzyme
Mol. Mass.:
70130.58
Organism:
Homo sapiens (Human)
Description:
P03951
Residue:
625
  
Inhibitor
Name:
BDBM33033
Synonyms:
4-oxo-5-phenyl-1,2-dihydro-4H-pyrrolo[3,2,1-ij]quinolin-6-yl 2-furoate SMR000459005 | cid_2816399
Type:
Small organic molecule
Emp. Form.:
C22H15NO4
Mol. Mass.:
357.3588
SMILES:
O=C(Oc1c(-c2ccccc2)c(=O)n2CCc3cccc1c23)c1ccco1
:
Substrate
Name:
Boc-Glu-Ala-Arg-AMC
Synonyms:
Type:
fluorescent substrate peptide
Mol. Mass.:
358.43
Organism:
Description:
Residue:
3
NA