Target
Bcl-2-related protein A1
Ligand
BDBM33049
Substrate
FITC-conjugated-Bim BH3 Peptide
Meas. Tech.
Multiplexed dose response screen for small molecule regulators of Bcl-2 family protein interactions, specifically Bim-Bfl-1.
pH
7.4±n/a
Temperature
277.15±n/a K
EC50
14990±n/a nM
Citation
 PubChem, PC Multiplexed dose response screen for small molecule regulators of Bcl-2 family protein interactions, specifically Bim-Bfl-1. PubChem Bioassay (2008)[AID] 
Target
Name:
Bcl-2-related protein A1
Synonyms:
B2LA1_HUMAN BCL2L5 Bcl-2-like protein 5 HBPA1 Protein BFL-1 | Protein GRS
Type:
Apoptosis regulator protein
Mol. Mass.:
20130.01
Organism:
Homo sapiens (Human)
Description:
Residue:
175
  
Inhibitor
Name:
BDBM33049
Synonyms:
(4-chlorodithiazol-5-ylidene)-(3,5-dimethoxyphenyl)amine 4-chloro-N-(3,5-dimethoxyphenyl)-5-dithiazolimine MLS000044018 SMR000021429 | cid_715724
Type:
Small organic molecule
Emp. Form.:
C10H9ClN2O2S2
Mol. Mass.:
288.774
SMILES:
COc1cc(OC)cc(c1)\N=c1\ssnc1Cl
:
Substrate
Name:
FITC-conjugated-Bim BH3 Peptide
Synonyms:
FITC-Ahx-DMRPEIWIAQELRRIGDEFNAYYAR-OH
Type:
FITC-labeled Peptide
Mol. Mass.:
3112.46
Organism:
Description:
Residue:
25