Target
Bcl-2-related protein A1
Ligand
BDBM31704
Substrate
FITC-conjugated-Bim BH3 Peptide
Meas. Tech.
Multiplexed dose response screen for small molecule regulators of Bcl-2 family protein interactions, specifically Bim-Bfl-1.
pH
7.4±n/a
Temperature
277.15±n/a K
EC50
920±n/a nM
Citation
 PubChem, PC Multiplexed dose response screen for small molecule regulators of Bcl-2 family protein interactions, specifically Bim-Bfl-1. PubChem Bioassay (2008)[AID] 
Target
Name:
Bcl-2-related protein A1
Synonyms:
B2LA1_HUMAN BCL2L5 Bcl-2-like protein 5 HBPA1 Protein BFL-1 | Protein GRS
Type:
Apoptosis regulator protein
Mol. Mass.:
20130.01
Organism:
Homo sapiens (Human)
Description:
Residue:
175
  
Inhibitor
Name:
BDBM31704
Synonyms:
MLS000050353 N-[2,3-bis(2-furanyl)-6-quinoxalinyl]-1-azepanecarboxamide N-[2,3-bis(furan-2-yl)quinoxalin-6-yl]azepane-1-carboxamide cid_2214811
Type:
Small organic molecule
Emp. Form.:
C23H22N4O3
Mol. Mass.:
402.4458
SMILES:
O=C(Nc1ccc2nc(-c3ccco3)c(nc2c1)-c1ccco1)N1CCCCCC1
:
Substrate
Name:
FITC-conjugated-Bim BH3 Peptide
Synonyms:
FITC-Ahx-DMRPEIWIAQELRRIGDEFNAYYAR-OH
Type:
FITC-labeled Peptide
Mol. Mass.:
3112.46
Organism:
Description:
Residue:
25