Target
Bcl-2-related protein A1
Ligand
BDBM33076
Substrate
FITC-conjugated-Bim BH3 Peptide
Meas. Tech.
Multiplexed dose response screen for small molecule regulators of Bcl-2 family protein interactions, specifically Bim-Bfl-1.
pH
7.4±n/a
Temperature
277.15±n/a K
EC50
4930±n/a nM
Citation
 PubChem, PC Multiplexed dose response screen for small molecule regulators of Bcl-2 family protein interactions, specifically Bim-Bfl-1. PubChem Bioassay (2008)[AID] 
Target
Name:
Bcl-2-related protein A1
Synonyms:
B2LA1_HUMAN BCL2L5 Bcl-2-like protein 5 HBPA1 Protein BFL-1 | Protein GRS
Type:
Apoptosis regulator protein
Mol. Mass.:
20130.01
Organism:
Homo sapiens (Human)
Description:
Residue:
175
  
Inhibitor
Name:
BDBM33076
Synonyms:
2,3-bis(2-furanyl)-6-methoxyquinoxaline 2,3-bis(furan-2-yl)-6-methoxy-quinoxaline 2,3-di-2-furyl-6-methoxyquinoxaline SMR000137313 | cid_762708
Type:
Small organic molecule
Emp. Form.:
C17H12N2O3
Mol. Mass.:
292.2888
SMILES:
COc1ccc2nc(-c3ccco3)c(nc2c1)-c1ccco1
:
Substrate
Name:
FITC-conjugated-Bim BH3 Peptide
Synonyms:
FITC-Ahx-DMRPEIWIAQELRRIGDEFNAYYAR-OH
Type:
FITC-labeled Peptide
Mol. Mass.:
3112.46
Organism:
Description:
Residue:
25