Target
Bcl-2-related protein A1
Ligand
BDBM33079
Substrate
FITC-conjugated-Bim BH3 Peptide
Meas. Tech.
Multiplexed dose response screen for small molecule regulators of Bcl-2 family protein interactions, specifically Bim-Bfl-1.
pH
7.4±n/a
Temperature
277.15±n/a K
EC50
870±n/a nM
Citation
 PubChem, PC Multiplexed dose response screen for small molecule regulators of Bcl-2 family protein interactions, specifically Bim-Bfl-1. PubChem Bioassay (2008)[AID] 
Target
Name:
Bcl-2-related protein A1
Synonyms:
B2LA1_HUMAN BCL2L5 Bcl-2-like protein 5 HBPA1 Protein BFL-1 | Protein GRS
Type:
Apoptosis regulator protein
Mol. Mass.:
20130.01
Organism:
Homo sapiens (Human)
Description:
Residue:
175
  
Inhibitor
Name:
BDBM33079
Synonyms:
2-(2-bromo-6-methoxy-4-{[(2-oxo-2,3-dihydro-1H-benzimidazol-5-yl)amino]methyl}phenoxy)-N-(tert-butyl)acetamide 2-[2-bromo-4-[[(2-keto-1,3-dihydrobenzimidazol-5-yl)amino]methyl]-6-methoxy-phenoxy]-N-tert-butyl-acetamide MLS000530854 cid_1017339
Type:
Small organic molecule
Emp. Form.:
C21H25BrN4O4
Mol. Mass.:
477.352
SMILES:
COc1cc(CNc2ccc3[nH]c(=O)[nH]c3c2)cc(Br)c1OCC(=O)NC(C)(C)C
:
Substrate
Name:
FITC-conjugated-Bim BH3 Peptide
Synonyms:
FITC-Ahx-DMRPEIWIAQELRRIGDEFNAYYAR-OH
Type:
FITC-labeled Peptide
Mol. Mass.:
3112.46
Organism:
Description:
Residue:
25