Target
Bcl-2-related protein A1
Ligand
BDBM33094
Substrate
FITC-conjugated-Bim BH3 Peptide
Meas. Tech.
Multiplexed dose response screen for small molecule regulators of Bcl-2 family protein interactions, specifically Bim-Bfl-1.
pH
7.4±n/a
Temperature
277.15±n/a K
EC50
2800±n/a nM
Citation
 PubChem, PC Multiplexed dose response screen for small molecule regulators of Bcl-2 family protein interactions, specifically Bim-Bfl-1. PubChem Bioassay (2008)[AID] 
Target
Name:
Bcl-2-related protein A1
Synonyms:
B2LA1_HUMAN BCL2L5 Bcl-2-like protein 5 HBPA1 Protein BFL-1 | Protein GRS
Type:
Apoptosis regulator protein
Mol. Mass.:
20130.01
Organism:
Homo sapiens (Human)
Description:
Residue:
175
  
Inhibitor
Name:
BDBM33094
Synonyms:
4-({2-[(4-chlorobenzyl)oxy]-3-ethoxybenzyl}amino)phenol 4-[[2-[(4-chlorophenyl)methoxy]-3-ethoxy-phenyl]methylamino]phenol MLS000540074 cid_1807333
Type:
Small organic molecule
Emp. Form.:
C22H22ClNO3
Mol. Mass.:
383.868
SMILES:
CCOc1cccc(CNc2ccc(O)cc2)c1OCc1ccc(Cl)cc1
:
Substrate
Name:
FITC-conjugated-Bim BH3 Peptide
Synonyms:
FITC-Ahx-DMRPEIWIAQELRRIGDEFNAYYAR-OH
Type:
FITC-labeled Peptide
Mol. Mass.:
3112.46
Organism:
Description:
Residue:
25