Target
Bcl-2-related protein A1
Ligand
BDBM32298
Substrate
FITC-conjugated-Bim BH3 Peptide
Meas. Tech.
Multiplexed dose response screen for small molecule regulators of Bcl-2 family protein interactions, specifically Bim-Bfl-1.
pH
7.4±n/a
Temperature
277.15±n/a K
EC50
7030±n/a nM
Citation
 PubChem, PC Multiplexed dose response screen for small molecule regulators of Bcl-2 family protein interactions, specifically Bim-Bfl-1. PubChem Bioassay (2008)[AID] 
Target
Name:
Bcl-2-related protein A1
Synonyms:
B2LA1_HUMAN BCL2L5 Bcl-2-like protein 5 HBPA1 Protein BFL-1 | Protein GRS
Type:
Apoptosis regulator protein
Mol. Mass.:
20130.01
Organism:
Homo sapiens (Human)
Description:
Residue:
175
  
Inhibitor
Name:
BDBM32298
Synonyms:
(E)-1-phenyl-3-[5-(p-tolyl)-2-furyl]prop-2-en-1-one (E)-3-[5-(4-methylphenyl)furan-2-yl]-1-phenyl-prop-2-en-1-one 1-Phenyl-3-(5-p-tolyl-furan-2-yl)-propenone SMR000175496 | cid_5706152
Type:
Small organic molecule
Emp. Form.:
C20H16O2
Mol. Mass.:
288.3398
SMILES:
Cc1ccc(cc1)-c1ccc(\C=C\C(=O)c2ccccc2)o1
:
Substrate
Name:
FITC-conjugated-Bim BH3 Peptide
Synonyms:
FITC-Ahx-DMRPEIWIAQELRRIGDEFNAYYAR-OH
Type:
FITC-labeled Peptide
Mol. Mass.:
3112.46
Organism:
Description:
Residue:
25