Target
Bcl-2-related protein A1
Ligand
BDBM33135
Substrate
FITC-conjugated-Bim BH3 Peptide
Meas. Tech.
Multiplexed dose response screen for small molecule regulators of Bcl-2 family protein interactions, specifically Bim-Bfl-1.
pH
7.4±n/a
Temperature
277.15±n/a K
EC50
14910±n/a nM
Citation
 PubChem, PC Multiplexed dose response screen for small molecule regulators of Bcl-2 family protein interactions, specifically Bim-Bfl-1. PubChem Bioassay (2008)[AID] 
Target
Name:
Bcl-2-related protein A1
Synonyms:
B2LA1_HUMAN BCL2L5 Bcl-2-like protein 5 HBPA1 Protein BFL-1 | Protein GRS
Type:
Apoptosis regulator protein
Mol. Mass.:
20130.01
Organism:
Homo sapiens (Human)
Description:
Residue:
175
  
Inhibitor
Name:
BDBM33135
Synonyms:
3-[(E)-3-(3,4-dimethylphenyl)-1-oxoprop-2-enyl]-2-hydroxy-1-cyclohepta-2,4,6-trienone 3-[(E)-3-(3,4-dimethylphenyl)prop-2-enoyl]-2-hydroxycyclohepta-2,4,6-trien-1-one 3-[3-(3,4-dimethylphenyl)acryloyl]-2-hydroxy-2,4,6-cycloheptatrien-1-one SMR000229847 | cid_6110289
Type:
Small organic molecule
Emp. Form.:
C18H16O3
Mol. Mass.:
280.3178
SMILES:
Cc1ccc(\C=C\C(=O)c2ccccc(=O)c2O)cc1C
:
Substrate
Name:
FITC-conjugated-Bim BH3 Peptide
Synonyms:
FITC-Ahx-DMRPEIWIAQELRRIGDEFNAYYAR-OH
Type:
FITC-labeled Peptide
Mol. Mass.:
3112.46
Organism:
Description:
Residue:
25