Target
Bcl-2-related protein A1
Ligand
BDBM33152
Substrate
FITC-conjugated-Bim BH3 Peptide
Meas. Tech.
Multiplexed dose response screen for small molecule regulators of Bcl-2 family protein interactions, specifically Bim-Bfl-1.
pH
7.4±n/a
Temperature
277.15±n/a K
EC50
31680±n/a nM
Citation
 PubChem, PC Multiplexed dose response screen for small molecule regulators of Bcl-2 family protein interactions, specifically Bim-Bfl-1. PubChem Bioassay (2008)[AID] 
Target
Name:
Bcl-2-related protein A1
Synonyms:
B2LA1_HUMAN BCL2L5 Bcl-2-like protein 5 HBPA1 Protein BFL-1 | Protein GRS
Type:
Apoptosis regulator protein
Mol. Mass.:
20130.01
Organism:
Homo sapiens (Human)
Description:
Residue:
175
  
Inhibitor
Name:
BDBM33152
Synonyms:
(Z)-2-butenedioate;4-[[2-(methylaminomethyl)phenyl]thio]benzene-1,2-diol 4-({2-[(methylamino)methyl]phenyl}sulfanyl)-1,2-benzenediol MLS000704368 cid_15945766
Type:
Small organic molecule
Emp. Form.:
C14H15NO2S
Mol. Mass.:
261.339
SMILES:
CNCc1ccccc1Sc1ccc(O)c(O)c1
:
Substrate
Name:
FITC-conjugated-Bim BH3 Peptide
Synonyms:
FITC-Ahx-DMRPEIWIAQELRRIGDEFNAYYAR-OH
Type:
FITC-labeled Peptide
Mol. Mass.:
3112.46
Organism:
Description:
Residue:
25