Target
Bcl-2-related protein A1
Ligand
BDBM33188
Substrate
FITC-conjugated-Bim BH3 Peptide
Meas. Tech.
Multiplexed dose response screen for small molecule regulators of Bcl-2 family protein interactions, specifically Bim-Bfl-1.
pH
7.4±n/a
Temperature
277.15±n/a K
EC50
520±n/a nM
Citation
 PubChem, PC Multiplexed dose response screen for small molecule regulators of Bcl-2 family protein interactions, specifically Bim-Bfl-1. PubChem Bioassay (2008)[AID] 
Target
Name:
Bcl-2-related protein A1
Synonyms:
B2LA1_HUMAN BCL2L5 Bcl-2-like protein 5 HBPA1 Protein BFL-1 | Protein GRS
Type:
Apoptosis regulator protein
Mol. Mass.:
20130.01
Organism:
Homo sapiens (Human)
Description:
Residue:
175
  
Inhibitor
Name:
BDBM33188
Synonyms:
2-({7-[(5-methyl-1,3,4-thiadiazol-2-yl)thio]-4-nitro-2,1,3-benzoxadiazol-5-yl}amino)ethanol 2-[[7-[(5-methyl-1,3,4-thiadiazol-2-yl)thio]-4-nitro-2,1,3-benzoxadiazol-5-yl]amino]ethanol MLS000674024 cid_16195158
Type:
Small organic molecule
Emp. Form.:
C11H10N6O4S2
Mol. Mass.:
354.365
SMILES:
Cc1nnc(Sc2cc(NCCO)c([N+]([O-])=O)c3nonc23)s1
:
Substrate
Name:
FITC-conjugated-Bim BH3 Peptide
Synonyms:
FITC-Ahx-DMRPEIWIAQELRRIGDEFNAYYAR-OH
Type:
FITC-labeled Peptide
Mol. Mass.:
3112.46
Organism:
Description:
Residue:
25