Target
Prothrombin
Ligand
BDBM32669
Substrate
Boc-Val-Pro-Arg-AMC
Meas. Tech.
Thrombin 1536 HTS Dose Response Confirmation
pH
7.5±n/a
Temperature
296.15±n/a K
IC50
204±n/a nM
Citation
 PubChem, PC Thrombin 1536 HTS Dose Response Confirmation PubChem Bioassay (2008)[AID] 
Target
Name:
Prothrombin
Synonyms:
Activation peptide fragment 1 Coagulation factor II Prothrombin precursor Thrombin heavy chain | Thrombin light chain
Type:
Protein
Mol. Mass.:
70029.57
Organism:
Homo sapiens (Human)
Description:
P00734
Residue:
622
  
Inhibitor
Name:
BDBM32669
Synonyms:
(3,4-dimethoxyphenyl)-[3-(2-furanyl)-5-(methylthio)-1,2,4-triazol-1-yl]methanone (3,4-dimethoxyphenyl)-[3-(furan-2-yl)-5-methylsulfanyl-1,2,4-triazol-1-yl]methanone MLS000049344 cid_976363
Type:
Small organic molecule
Emp. Form.:
C16H15N3O4S
Mol. Mass.:
345.373
SMILES:
COc1ccc(cc1OC)C(=O)n1nc(nc1SC)-c1ccco1
:
Substrate
Name:
Boc-Val-Pro-Arg-AMC
Synonyms:
Type:
fluorogenic substrate
Mol. Mass.:
358.43
Organism:
Description:
Residue:
3
NA