Target
Prothrombin
Ligand
BDBM33654
Substrate
Boc-Val-Pro-Arg-AMC
Meas. Tech.
Thrombin 1536 HTS Dose Response Confirmation
pH
7.5±n/a
Temperature
296.15±n/a K
IC50
33.06±n/a nM
Citation
 PubChem, PC Thrombin 1536 HTS Dose Response Confirmation PubChem Bioassay (2008)[AID] 
Target
Name:
Prothrombin
Synonyms:
Activation peptide fragment 1 Coagulation factor II Prothrombin precursor Thrombin heavy chain | Thrombin light chain
Type:
Protein
Mol. Mass.:
70029.57
Organism:
Homo sapiens (Human)
Description:
P00734
Residue:
622
  
Inhibitor
Name:
BDBM33654
Synonyms:
6-(diethylsulfamoyl)-1-methyl-4-oxidanylidene-N-(thiophen-2-ylmethyl)quinoline-3-carboxamide 6-(diethylsulfamoyl)-1-methyl-4-oxo-N-(thiophen-2-ylmethyl)quinoline-3-carboxamide MLS000521879 cid_9550135
Type:
Small organic molecule
Emp. Form.:
C20H23N3O4S2
Mol. Mass.:
433.544
SMILES:
CCN(CC)S(=O)(=O)c1ccc2n(C)cc(C(=O)NCc3cccs3)c(=O)c2c1
:
Substrate
Name:
Boc-Val-Pro-Arg-AMC
Synonyms:
Type:
fluorogenic substrate
Mol. Mass.:
358.43
Organism:
Description:
Residue:
3
NA