Target
Prothrombin
Ligand
BDBM33832
Substrate
Boc-Val-Pro-Arg-AMC
Meas. Tech.
Thrombin 1536 HTS Dose Response Confirmation
pH
7.5±n/a
Temperature
296.15±n/a K
IC50
4.65±n/a nM
Citation
 PubChem, PC Thrombin 1536 HTS Dose Response Confirmation PubChem Bioassay (2008)[AID] 
Target
Name:
Prothrombin
Synonyms:
Activation peptide fragment 1 Coagulation factor II Prothrombin precursor Thrombin heavy chain | Thrombin light chain
Type:
Protein
Mol. Mass.:
70029.57
Organism:
Homo sapiens (Human)
Description:
P00734
Residue:
622
  
Inhibitor
Name:
BDBM33832
Synonyms:
(2-methoxyphenyl)-[5-[(phenylmethyl)amino]-3-(3-pyridinyl)-1,2,4-triazol-1-yl]methanone MLS000679644 SMR000296887 [5-(benzylamino)-3-pyridin-3-yl-1,2,4-triazol-1-yl]-(2-methoxyphenyl)methanone | cid_2983598
Type:
Small organic molecule
Emp. Form.:
C22H19N5O2
Mol. Mass.:
385.4186
SMILES:
COc1ccccc1C(=O)n1nc(nc1NCc1ccccc1)-c1cccnc1
:
Substrate
Name:
Boc-Val-Pro-Arg-AMC
Synonyms:
Type:
fluorogenic substrate
Mol. Mass.:
358.43
Organism:
Description:
Residue:
3
NA