Target
Prothrombin
Ligand
BDBM33836
Substrate
Boc-Val-Pro-Arg-AMC
Meas. Tech.
Thrombin 1536 HTS Dose Response Confirmation
pH
7.5±n/a
Temperature
296.15±n/a K
IC50
1±n/a nM
Citation
 PubChem, PC Thrombin 1536 HTS Dose Response Confirmation PubChem Bioassay (2008)[AID] 
Target
Name:
Prothrombin
Synonyms:
Activation peptide fragment 1 Coagulation factor II Prothrombin precursor Thrombin heavy chain | Thrombin light chain
Type:
Protein
Mol. Mass.:
70029.57
Organism:
Homo sapiens (Human)
Description:
P00734
Residue:
622
  
Inhibitor
Name:
BDBM33836
Synonyms:
3-(2-furyl)-1-(3-pyridinylcarbonyl)-N-(2-thienylmethyl)-1H-1,2,4-triazol-5-amine SMR000296733 [3-(2-furyl)-5-(2-thenylamino)-1,2,4-triazol-1-yl]-(3-pyridyl)methanone [3-(furan-2-yl)-5-(thiophen-2-ylmethylamino)-1,2,4-triazol-1-yl]-pyridin-3-ylmethanone | cid_2981331
Type:
Small organic molecule
Emp. Form.:
C17H13N5O2S
Mol. Mass.:
351.382
SMILES:
O=C(c1cccnc1)n1nc(nc1NCc1cccs1)-c1ccco1
:
Substrate
Name:
Boc-Val-Pro-Arg-AMC
Synonyms:
Type:
fluorogenic substrate
Mol. Mass.:
358.43
Organism:
Description:
Residue:
3
NA