Target
Bcl-2-related protein A1
Ligand
BDBM34177
Substrate
FITC-Ahx-EDIIRNIARHLAQVGDSMDR
Meas. Tech.
HTS discovery of chemical inhibitors of anti-apoptotic protein Bfl-1
pH
7±n/a
Temperature
296.15±n/a K
IC50
>100000±0 nM
Citation
 PubChem, PC HTS discovery of chemical inhibitors of anti-apoptotic protein Bfl-1 PubChem Bioassay (2008)[AID] 
Target
Name:
Bcl-2-related protein A1
Synonyms:
A1 B-cell leukemia/lymphoma 2 related protein A1a Bcl2a1 Bfl-1 Hemopoietic-specific early response protein | Protein BFL-1
Type:
Apoptosis regulator protein
Mol. Mass.:
19909.74
Organism:
Mus musculus (Mouse)
Description:
gi_11024684
Residue:
172
  
Inhibitor
Name:
BDBM34177
Synonyms:
7-(2-furanyl)-5-(4-phenylphenyl)-1,7-dihydro-[1,2,4]triazolo[1,5-a]pyrimidine 7-(furan-2-yl)-5-(4-phenylphenyl)-1,7-dihydro-[1,2,4]triazolo[1,5-a]pyrimidine SMR000046645 | cid_5389939
Type:
Small organic molecule
Emp. Form.:
C21H16N4O
Mol. Mass.:
340.3779
SMILES:
C1C(c2ccco2)n2ncnc2N=C1c1ccc(cc1)-c1ccccc1
:
Substrate
Name:
FITC-Ahx-EDIIRNIARHLAQVGDSMDR
Synonyms:
FITC-Bid peptide
Type:
fluorescein-labeled peptide
Mol. Mass.:
358.43
Organism:
Description:
Residue:
3
NA