Target
Gag-Pol polyprotein
Ligand
BDBM32041
Substrate
RNA/DNA hybrid
Meas. Tech.
HIV-1 RT-RNase H MLSCN MH077605 Probe Assessment: Dose response Assay
pH
8±n/a
Temperature
296.15±n/a K
IC50
767.00002±n/a nM
Citation
 PubChem, PC HIV-1 RT-RNase H MLSCN MH077605 Probe Assessment: Dose response Assay PubChem Bioassay (2007)[AID] 
Target
Name:
Gag-Pol polyprotein
Synonyms:
HIV-1 reverse transcriptase (HIV-1 RT) POL_HV1H2 Protease Reverse transcriptase (RT) gag-pol p66 RT
Type:
Protein
Mol. Mass.:
162074.74
Organism:
Human immunodeficiency virus type 1 group M subtype B (isolate HXB2)
Description:
P04585
Residue:
1435
  
Inhibitor
Name:
BDBM32041
Synonyms:
3-[[(Z)-(3-hydroxy-4-keto-cyclohexa-2,5-dien-1-ylidene)methyl]amino]-2-propyl-quinazolin-4-one 3-[[(Z)-(3-hydroxy-4-oxocyclohexa-2,5-dien-1-ylidene)methyl]amino]-2-propylquinazolin-4-one MLS000039021 cid_5389225
Type:
Small organic molecule
Emp. Form.:
C18H17N3O3
Mol. Mass.:
323.3459
SMILES:
CCCc1nc2ccccc2c(=O)n1N=Cc1ccc(O)c(O)c1
:
Substrate
Name:
RNA/DNA hybrid
Synonyms:
Type:
fluorescein-labeled RNA annealed to DNA
Mol. Mass.:
358.43
Organism:
Description:
It is a 18-nucleotide 3-fluorescein-labeled RNA annealed to a complementary 18-nucleotide 5-Dabcyl-modified DNA.
Residue:
3
NA