Target
Gag-Pol polyprotein
Ligand
BDBM34273
Substrate
RNA/DNA hybrid
Meas. Tech.
HIV-1 RT-RNase H MLSCN MH077605 Probe Assessment: Dose response Assay
pH
8±n/a
Temperature
296.15±n/a K
IC50
384.000003±n/a nM
Citation
 PubChem, PC HIV-1 RT-RNase H MLSCN MH077605 Probe Assessment: Dose response Assay PubChem Bioassay (2007)[AID] 
Target
Name:
Gag-Pol polyprotein
Synonyms:
HIV-1 reverse transcriptase (HIV-1 RT) POL_HV1H2 Protease Reverse transcriptase (RT) gag-pol p66 RT
Type:
Protein
Mol. Mass.:
162074.74
Organism:
Human immunodeficiency virus type 1 group M subtype B (isolate HXB2)
Description:
P04585
Residue:
1435
  
Inhibitor
Name:
BDBM34273
Synonyms:
3-(3-benzoyl-6-chloro-4,5-dihydroxy-1-benzofuran-7-yl)pentane-2,4-dione 3-(3-benzoyl-6-chloro-4,5-dihydroxy-benzofuran-7-yl)pentane-2,4-dione MLS000040279 cid_665013
Type:
Small organic molecule
Emp. Form.:
C20H15ClO6
Mol. Mass.:
386.783
SMILES:
CC(=O)C(C(C)=O)c1c(Cl)c(O)c(O)c2c(coc12)C(=O)c1ccccc1
:
Substrate
Name:
RNA/DNA hybrid
Synonyms:
Type:
fluorescein-labeled RNA annealed to DNA
Mol. Mass.:
358.43
Organism:
Description:
It is a 18-nucleotide 3-fluorescein-labeled RNA annealed to a complementary 18-nucleotide 5-Dabcyl-modified DNA.
Residue:
3
NA