Target
Gag-Pol polyprotein
Ligand
BDBM34438
Substrate
RNA/DNA hybrid
Meas. Tech.
HIV-1 RT-RNase H MLSCN MH077605 Probe Assessment: Dose response Assay
pH
8±n/a
Temperature
296.15±n/a K
IC50
663.999975±n/a nM
Citation
 PubChem, PC HIV-1 RT-RNase H MLSCN MH077605 Probe Assessment: Dose response Assay PubChem Bioassay (2007)[AID] 
Target
Name:
Gag-Pol polyprotein
Synonyms:
HIV-1 reverse transcriptase (HIV-1 RT) POL_HV1H2 Protease Reverse transcriptase (RT) gag-pol p66 RT
Type:
Protein
Mol. Mass.:
162074.74
Organism:
Human immunodeficiency virus type 1 group M subtype B (isolate HXB2)
Description:
P04585
Residue:
1435
  
Inhibitor
Name:
BDBM34438
Synonyms:
1-{[6-(2,3-dihydro-1,4-benzodioxin-2-yl)[1,2,4]triazolo[3,4-b][1,3,4]thiadiazol-3-yl]methyl}-1H-1,2,3-benzotriazole 3-(benzotriazol-1-ylmethyl)-6-(2,3-dihydro-1,4-benzodioxin-3-yl)-[1,2,4]triazolo[3,4-b][1,3,4]thiadiazole SMR000080901 | cid_2971957
Type:
Small organic molecule
Emp. Form.:
C18H13N7O2S
Mol. Mass.:
391.407
SMILES:
C(c1nnc2sc(nn12)C1COc2ccccc2O1)n1nnc2ccccc12
:
Substrate
Name:
RNA/DNA hybrid
Synonyms:
Type:
fluorescein-labeled RNA annealed to DNA
Mol. Mass.:
358.43
Organism:
Description:
It is a 18-nucleotide 3-fluorescein-labeled RNA annealed to a complementary 18-nucleotide 5-Dabcyl-modified DNA.
Residue:
3
NA