Target
Mannose-6-phosphate isomerase
Ligand
BDBM33085
Substrate
Mannose-6-phosphate
Meas. Tech.
HTS identification of compounds inhibiting phosphomannose isomerase (PMI) via a fluorescence intensity assay using a high concentration of mannose 6-phosphate
pH
7.4±n/a
Temperature
296.15±n/a K
IC50
6340±0 nM
Citation
 PubChem, PC HTS identification of compounds inhibiting phosphomannose isomerase (PMI) via a fluorescence intensity assay using a high concentration of mannose 6-phosphate PubChem Bioassay (2009)[AID] 
Target
Name:
Mannose-6-phosphate isomerase
Synonyms:
MPI MPI_HUMAN PMI1
Type:
PROTEIN
Mol. Mass.:
46651.35
Organism:
Homo sapiens (Human)
Description:
ChEMBL_1448919
Residue:
423
  
Inhibitor
Name:
BDBM33085
Synonyms:
4-[(4-chloranyl-1,2,3-dithiazol-5-ylidene)amino]benzenecarbonitrile 4-[(4-chlorodithiazol-5-ylidene)amino]benzonitrile SMR000130044 | cid_715698
Type:
Small organic molecule
Emp. Form.:
C9H4ClN3S2
Mol. Mass.:
253.731
SMILES:
Clc1nss\c1=N\c1ccc(cc1)C#N
:
Substrate
Name:
Mannose-6-phosphate
Synonyms:
Type:
Mol. Mass.:
358.43
Organism:
Description:
Residue:
3
NA