Target
Mannose-6-phosphate isomerase
Ligand
BDBM34698
Substrate
Mannose-6-phosphate
Meas. Tech.
HTS identification of compounds inhibiting phosphomannose isomerase (PMI) via a fluorescence intensity assay using a high concentration of mannose 6-phosphate
pH
7.4±n/a
Temperature
296.15±n/a K
IC50
4843.5±0 nM
Citation
 PubChem, PC HTS identification of compounds inhibiting phosphomannose isomerase (PMI) via a fluorescence intensity assay using a high concentration of mannose 6-phosphate PubChem Bioassay (2009)[AID] 
Target
Name:
Mannose-6-phosphate isomerase
Synonyms:
MPI MPI_HUMAN PMI1
Type:
PROTEIN
Mol. Mass.:
46651.35
Organism:
Homo sapiens (Human)
Description:
ChEMBL_1448919
Residue:
423
  
Inhibitor
Name:
BDBM34698
Synonyms:
3-[(3-amino-5-sulfanyl-4H-1,2,4-triazol-4-yl)imino]-1,3-dihydro-2H-indol-2-one 3-[(3-amino-5-sulfanylidene-1H-1,2,4-triazol-4-yl)amino]indol-2-one 3-[(3-azanyl-5-sulfanylidene-1H-1,2,4-triazol-4-yl)amino]indol-2-one SMR000114465 | cid_3742960
Type:
Small organic molecule
Emp. Form.:
C10H8N6OS
Mol. Mass.:
260.275
SMILES:
Nc1n[nH]c(=S)n1NC1=c2ccccc2=NC1=O
:
Substrate
Name:
Mannose-6-phosphate
Synonyms:
Type:
Mol. Mass.:
358.43
Organism:
Description:
Residue:
3
NA