Target
Mannose-6-phosphate isomerase
Ligand
BDBM22775
Substrate
Mannose-6-phosphate
Meas. Tech.
HTS identification of compounds inhibiting phosphomannose isomerase (PMI) via a fluorescence intensity assay using a high concentration of mannose 6-phosphate
pH
7.4±n/a
Temperature
296.15±n/a K
IC50
9843.6±0 nM
Citation
 PubChem, PC HTS identification of compounds inhibiting phosphomannose isomerase (PMI) via a fluorescence intensity assay using a high concentration of mannose 6-phosphate PubChem Bioassay (2009)[AID] 
Target
Name:
Mannose-6-phosphate isomerase
Synonyms:
MPI MPI_HUMAN PMI1
Type:
PROTEIN
Mol. Mass.:
46651.35
Organism:
Homo sapiens (Human)
Description:
ChEMBL_1448919
Residue:
423
  
Inhibitor
Name:
BDBM22775
Synonyms:
3,5-di-tert-butylcyclohexa-3,5-diene-1,2-dione cid_76915
Type:
Small organic molecule
Emp. Form.:
C14H20O2
Mol. Mass.:
220.3074
SMILES:
CC(C)(C)C1=CC(=O)C(=O)C(=C1)C(C)(C)C
:
Substrate
Name:
Mannose-6-phosphate
Synonyms:
Type:
Mol. Mass.:
358.43
Organism:
Description:
Residue:
3
NA