Target
Mannose-6-phosphate isomerase
Ligand
BDBM34838
Substrate
Mannose-6-phosphate
Meas. Tech.
HTS identification of compounds inhibiting phosphomannose isomerase (PMI) via a fluorescence intensity assay using a high concentration of mannose 6-phosphate
pH
7.4±n/a
Temperature
296.15±n/a K
IC50
11773±0 nM
Citation
 PubChem, PC HTS identification of compounds inhibiting phosphomannose isomerase (PMI) via a fluorescence intensity assay using a high concentration of mannose 6-phosphate PubChem Bioassay (2009)[AID] 
Target
Name:
Mannose-6-phosphate isomerase
Synonyms:
MPI MPI_HUMAN PMI1
Type:
PROTEIN
Mol. Mass.:
46651.35
Organism:
Homo sapiens (Human)
Description:
ChEMBL_1448919
Residue:
423
  
Inhibitor
Name:
BDBM34838
Synonyms:
4-[(5-chloro-8-hydroxy-7-quinolinyl)methyl]-1-piperazinecarboxylic acid ethyl ester MLS000715651 cid_716585 ethyl 4-[(5-chloro-8-hydroxyquinolin-7-yl)methyl]piperazine-1-carboxylate
Type:
Small organic molecule
Emp. Form.:
C17H20ClN3O3
Mol. Mass.:
349.812
SMILES:
CCOC(=O)N1CCN(Cc2cc(Cl)c3cccnc3c2O)CC1
:
Substrate
Name:
Mannose-6-phosphate
Synonyms:
Type:
Mol. Mass.:
358.43
Organism:
Description:
Residue:
3
NA