Target
Mannose-6-phosphate isomerase
Ligand
BDBM34886
Substrate
Mannose-6-phosphate
Meas. Tech.
HTS identification of compounds inhibiting phosphomannose isomerase (PMI) via a fluorescence intensity assay using a high concentration of mannose 6-phosphate
pH
7.4±n/a
Temperature
296.15±n/a K
IC50
8625.3±0 nM
Citation
 PubChem, PC HTS identification of compounds inhibiting phosphomannose isomerase (PMI) via a fluorescence intensity assay using a high concentration of mannose 6-phosphate PubChem Bioassay (2009)[AID] 
Target
Name:
Mannose-6-phosphate isomerase
Synonyms:
MPI MPI_HUMAN PMI1
Type:
PROTEIN
Mol. Mass.:
46651.35
Organism:
Homo sapiens (Human)
Description:
ChEMBL_1448919
Residue:
423
  
Inhibitor
Name:
BDBM34886
Synonyms:
(E)-3-[6-hydroxy-2-(1-hydroxy-1-methyl-ethyl)coumaran-5-yl]acrylic acid (E)-3-[6-hydroxy-2-(2-hydroxypropan-2-yl)-2,3-dihydrobenzofuran-5-yl]-2-propenoic acid MLS000703346 cid_5759329
Type:
Small organic molecule
Emp. Form.:
C14H16O5
Mol. Mass.:
264.2738
SMILES:
CC(C)(O)C1Cc2cc(\C=C\C(O)=O)c(O)cc2O1
:
Substrate
Name:
Mannose-6-phosphate
Synonyms:
Type:
Mol. Mass.:
358.43
Organism:
Description:
Residue:
3
NA