Target
Mannose-6-phosphate isomerase
Ligand
BDBM34966
Substrate
Mannose-6-phosphate
Meas. Tech.
HTS identification of compounds inhibiting phosphomannose isomerase (PMI) via a fluorescence intensity assay using a high concentration of mannose 6-phosphate
pH
7.4±n/a
Temperature
296.15±n/a K
IC50
11715.6±0 nM
Citation
 PubChem, PC HTS identification of compounds inhibiting phosphomannose isomerase (PMI) via a fluorescence intensity assay using a high concentration of mannose 6-phosphate PubChem Bioassay (2009)[AID] 
Target
Name:
Mannose-6-phosphate isomerase
Synonyms:
MPI MPI_HUMAN PMI1
Type:
PROTEIN
Mol. Mass.:
46651.35
Organism:
Homo sapiens (Human)
Description:
ChEMBL_1448919
Residue:
423
  
Inhibitor
Name:
BDBM34966
Synonyms:
3-(3-keto-1,2-benzothiazol-2-yl)-N,N-dimethyl-benzenesulfonamide N,N-dimethyl-3-(3-oxidanylidene-1,2-benzothiazol-2-yl)benzenesulfonamide SMR000364449 | cid_5040456
Type:
Small organic molecule
Emp. Form.:
C15H14N2O3S2
Mol. Mass.:
334.413
SMILES:
CN(C)S(=O)(=O)c1cccc(c1)-n1sc2ccccc2c1=O
:
Substrate
Name:
Mannose-6-phosphate
Synonyms:
Type:
Mol. Mass.:
358.43
Organism:
Description:
Residue:
3
NA