Target
Tyrosine-protein kinase Mer
Ligand
BDBM350855
Substrate
Meas. Tech.
Inhibition Assay
IC50
0.970±n/a nM
Citation
 Wang, XZhang, WFrye, S Therapeutic uses of selected pyrrolopyrimidine compounds with anti-mer tyrosine kinase activity US Patent  US10004755 Publication Date 6/26/2018 
Target
Name:
Tyrosine-protein kinase Mer
Synonyms:
MER MERTK Proto-oncogene c-Mer Receptor tyrosine kinase MerTK | Tyrosine-protein kinase Mer
Type:
PROTEIN
Mol. Mass.:
110234.77
Organism:
Homo sapiens (Human)
Description:
ChEMBL_1498723
Residue:
999
  
Inhibitor
Name:
BDBM350855
Synonyms:
UNC2143A US9795606, B14
Type:
Small organic molecule
Emp. Form.:
C27H38N6O
Mol. Mass.:
462.6302
SMILES:
CCCCNc1ncc2c(cn(C3CC[C@H](O)CC3)c2n1)-c1ccc(CN2CCNCC2)cc1
: