Target
26S proteasome non-ATPase regulatory subunit 14
Ligand
BDBM401021
Substrate
Meas. Tech.
Biochemical Assay
IC50
900±n/a nM
Citation
 Deshaies, RJLi, JCohen, SPerez, CMa, Y Inhibitors of RPN11 US Patent  US10005735 Publication Date 6/26/2018 
Target
Name:
26S proteasome non-ATPase regulatory subunit 14
Synonyms:
26S Proteasome regulatory subunit Rpn11 (Rpn11) PSDE_HUMAN PSMD14 protein
Type:
Protein
Mol. Mass.:
34576.68
Organism:
Homo sapiens (Human)
Description:
O00487
Residue:
310
  
Inhibitor
Name:
BDBM401021
Synonyms:
US10005735, Compound 20
Type:
Small organic molecule
Emp. Form.:
C18H14N2O3S
Mol. Mass.:
338.38
SMILES:
Sc1cccc2cc(cnc12)C(=O)NCc1ccc2OCOc2c1
: