Target
Leucyl-cystinyl aminopeptidase
Ligand
BDBM401393
Substrate
Meas. Tech.
Inhibition Assay
IC50
1.50±n/a nM
Citation
 Kawaguchi, KIshihata, AKanai, ATsuchiya, KInagaki, YKazami, JMorikawa, HHiramoto, MEnjo, KTakamatsu, H Pyridine derivatives US Patent  US10005762 Publication Date 6/26/2018 
Target
Name:
Leucyl-cystinyl aminopeptidase
Synonyms:
Cystinyl aminopeptidase Insulin-regulated membrane aminopeptidase Irap Leucyl-cystinyl aminopeptidase Otase P-LAP Vesicle protein of 165 kDa | Vp165
Type:
PROTEIN
Mol. Mass.:
117179.39
Organism:
Rattus norvegicus
Description:
ChEMBL_98523
Residue:
1025
  
Inhibitor
Name:
BDBM401393
Synonyms:
US10005762, Example 73
Type:
Small organic molecule
Emp. Form.:
C21H34N2O3
Mol. Mass.:
362.5063
SMILES:
CC(C)C[C@H](N)[C@](O)(Cc1cc(CCCCC2CC2)c(C)cn1)C(O)=O
: