Target
5-hydroxytryptamine receptor 2A
Ligand
BDBM35244
Substrate
BDBM21395
Meas. Tech.
Radioligand Binding Assay (Ki) and Norepinephrine Uptake Assay (IC50)
Ki
110±n/a nM
IC50
650±n/a nM
Citation
 Heffernan, GDCoghlan, RDManas, ESMcDevitt, RELi, YMahaney, PERobichaud, AJHuselton, CAlfinito, PBray, JACosmi, SAJohnston, GHKenney, TKoury, EWinneker, RCDeecher, DCTrybulski, EJ Dual acting norepinephrine reuptake inhibitors and 5-HT(2A) receptor antagonists: Identification, synthesis and activity of novel 4-aminoethyl-3-(phenylsulfonyl)-1H-indoles. Bioorg Med Chem 17:7802-15 (2009)  
Target
Name:
5-hydroxytryptamine receptor 2A
Synonyms:
5-HT-2 5-HT2A 5-hydroxytryptamine receptor 2A (5HT-2A) 5HT2A_HUMAN HTR2A | Serotonin receptor 2A
Type:
undefined
Mol. Mass.:
52607.65
Organism:
Homo sapiens (Human)
Description:
P28223
Residue:
471
  
Inhibitor
Name:
BDBM35244
Synonyms:
3-(phenylsulfonyl)-1H-indole, 18f
Type:
Small organic molecule
Emp. Form.:
C19H22N2O2S
Mol. Mass.:
342.455
SMILES:
CC(C)NCCc1cccc2[nH]cc(c12)S(=O)(=O)c1ccccc1
:
Substrate
Name:
BDBM21395
Synonyms:
3-(2-(4-(4-Fluorobenzoyl)piperidinol)ethyl)-2,4(1H,3H)-quinazolinedione CHEMBL1628637 Ketanserin R-41-468 [3H]-Ketanserin
Type:
radiolabeled ligand
Emp. Form.:
C22H22FN3O3
Mol. Mass.:
395.4268
SMILES:
Fc1ccc(cc1)C(=O)C1CCN(CCn2c(=O)[nH]c3ccccc3c2=O)CC1
: