Target
Dual specificity protein phosphatase 1
Ligand
BDBM31040
Substrate
OMFP Substrate
Meas. Tech.
In vitro MKP-1 Phosphatase HTS Dose Response Confirmation Assay
pH
7±n/a
Temperature
295.15±n/a K
IC50
197±n/a nM
Citation
 PubChem, PC In vitro MKP-1 Phosphatase HTS Dose Response Confirmation Assay PubChem Bioassay (2007)[AID] 
Target
Name:
Dual specificity protein phosphatase 1
Synonyms:
CL100 DUSP1 MAP kinase phosphatase 1 MKP1 Protein-tyrosine phosphatase CL100 | VH1
Type:
Protein phosphatase
Mol. Mass.:
39301.48
Organism:
Homo sapiens (Human)
Description:
gi_4758204
Residue:
367
  
Inhibitor
Name:
BDBM31040
Synonyms:
1-Ethyl-6-methyl-3-phenyl-1H-pyrimido[5,4-e][1,2,4]triazine-5,7-dione 1-ethyl-6-methyl-3-phenyl-pyrimido[5,4-e][1,2,4]triazine-5,7-quinone MLS000027832 US9073941, 602 | cid_647501
Type:
Small organic molecule
Emp. Form.:
C14H13N5O2
Mol. Mass.:
283.2853
SMILES:
CCn1nc(nc2c1nc(=O)n(C)c2=O)-c1ccccc1
:
Substrate
Name:
OMFP Substrate
Synonyms:
3-O-methylfluorescein phosphate | OMFP
Type:
fluorescent substrate
Mol. Mass.:
358.43
Organism:
Description:
Residue:
3
NA