Target
Dual specificity protein phosphatase 1
Ligand
BDBM35374
Substrate
OMFP Substrate
Meas. Tech.
In vitro MKP-1 Phosphatase HTS Dose Response Confirmation Assay
pH
7±n/a
Temperature
295.15±n/a K
IC50
>50000±n/a nM
Citation
 PubChem, PC In vitro MKP-1 Phosphatase HTS Dose Response Confirmation Assay PubChem Bioassay (2007)[AID] 
Target
Name:
Dual specificity protein phosphatase 1
Synonyms:
CL100 DUSP1 MAP kinase phosphatase 1 MKP1 Protein-tyrosine phosphatase CL100 | VH1
Type:
Protein phosphatase
Mol. Mass.:
39301.48
Organism:
Homo sapiens (Human)
Description:
gi_4758204
Residue:
367
  
Inhibitor
Name:
BDBM35374
Synonyms:
4-[[4-cyclohexyl-5-(2-thenyl)-1,2,4-triazol-3-yl]thio]-2-(1,3-dihydrobenzimidazol-2-ylidene)-3-keto-butyronitrile 4-[[4-cyclohexyl-5-(thiophen-2-ylmethyl)-1,2,4-triazol-3-yl]sulfanyl]-2-(1,3-dihydrobenzimidazol-2-ylidene)-3-oxobutanenitrile MLS000098387 cid_5685112
Type:
Small organic molecule
Emp. Form.:
C24H24N6OS2
Mol. Mass.:
476.617
SMILES:
O=C(CSc1nnc(Cc2cccs2)n1C1CCCCC1)C(C#N)c1nc2ccccc2[nH]1
:
Substrate
Name:
OMFP Substrate
Synonyms:
3-O-methylfluorescein phosphate | OMFP
Type:
fluorescent substrate
Mol. Mass.:
358.43
Organism:
Description:
Residue:
3
NA