Target
Dual specificity protein phosphatase 1
Ligand
BDBM35407
Substrate
OMFP Substrate
Meas. Tech.
In vitro MKP-1 Phosphatase HTS Dose Response Confirmation Assay
pH
7±n/a
Temperature
295.15±n/a K
IC50
7662±n/a nM
Citation
 PubChem, PC In vitro MKP-1 Phosphatase HTS Dose Response Confirmation Assay PubChem Bioassay (2007)[AID] 
Target
Name:
Dual specificity protein phosphatase 1
Synonyms:
CL100 DUSP1 MAP kinase phosphatase 1 MKP1 Protein-tyrosine phosphatase CL100 | VH1
Type:
Protein phosphatase
Mol. Mass.:
39301.48
Organism:
Homo sapiens (Human)
Description:
gi_4758204
Residue:
367
  
Inhibitor
Name:
BDBM35407
Synonyms:
8-(cyclohexoxycarbonyl)-3a,4,5,9b-tetrahydro-3H-cyclopenta[c]quinoline-4-carboxylic acid 8-[cyclohexyloxy(oxo)methyl]-3a,4,5,9b-tetrahydro-3H-cyclopenta[c]quinoline-4-carboxylic acid MLS000042958 cid_3243550
Type:
Small organic molecule
Emp. Form.:
C20H23NO4
Mol. Mass.:
341.4009
SMILES:
OC(=O)C1Nc2ccc(cc2C2C=CCC12)C(=O)OC1CCCCC1
:
Substrate
Name:
OMFP Substrate
Synonyms:
3-O-methylfluorescein phosphate | OMFP
Type:
fluorescent substrate
Mol. Mass.:
358.43
Organism:
Description:
Residue:
3
NA