Target
Dual specificity protein phosphatase 1
Ligand
BDBM34527
Substrate
OMFP Substrate
Meas. Tech.
In vitro MKP-1 Phosphatase HTS Dose Response Confirmation Assay
pH
7±n/a
Temperature
295.15±n/a K
IC50
>50000±n/a nM
Citation
 PubChem, PC In vitro MKP-1 Phosphatase HTS Dose Response Confirmation Assay PubChem Bioassay (2007)[AID] 
Target
Name:
Dual specificity protein phosphatase 1
Synonyms:
CL100 DUSP1 MAP kinase phosphatase 1 MKP1 Protein-tyrosine phosphatase CL100 | VH1
Type:
Protein phosphatase
Mol. Mass.:
39301.48
Organism:
Homo sapiens (Human)
Description:
gi_4758204
Residue:
367
  
Inhibitor
Name:
BDBM34527
Synonyms:
2-[(2-keto-2-pyrrolidino-ethyl)thio]-3-(4-methoxyphenyl)-5H-pyrimid[5,4-b]indol-4-one 3-(4-methoxyphenyl)-2-(2-oxo-2-pyrrolidin-1-ylethyl)sulfanyl-5H-pyrimido[5,4-b]indol-4-one MLS000101332 cid_2156119
Type:
Small organic molecule
Emp. Form.:
C23H22N4O3S
Mol. Mass.:
434.511
SMILES:
COc1ccc(cc1)-n1c(SCC(=O)N2CCCC2)nc2c3ccccc3[nH]c2c1=O
:
Substrate
Name:
OMFP Substrate
Synonyms:
3-O-methylfluorescein phosphate | OMFP
Type:
fluorescent substrate
Mol. Mass.:
358.43
Organism:
Description:
Residue:
3
NA