Target
Dual specificity protein phosphatase 1
Ligand
BDBM35443
Substrate
OMFP Substrate
Meas. Tech.
In vitro MKP-1 Phosphatase Dose Response SAR Support Assay
pH
7±n/a
Temperature
296.15±n/a K
IC50
>50000±n/a nM
Citation
 PubChem, PC In vitro MKP-1 Phosphatase Dose Response SAR Support Assay  PubChem Bioassay (2007)[AID] 
Target
Name:
Dual specificity protein phosphatase 1
Synonyms:
CL100 DUSP1 MAP kinase phosphatase 1 MKP1 Protein-tyrosine phosphatase CL100 | VH1
Type:
Protein phosphatase
Mol. Mass.:
39301.48
Organism:
Homo sapiens (Human)
Description:
gi_4758204
Residue:
367
  
Inhibitor
Name:
BDBM35443
Synonyms:
6-amino-5-(2-chloro-1-oxoethyl)-3-methyl-1-(2-methylpropyl)pyrimidine-2,4-dione 6-amino-5-(2-chloroacetyl)-3-methyl-1-(2-methylpropyl)pyrimidine-2,4-dione CC-PMLSC-DMA-P92 | cid_2490478
Type:
Small organic molecule
Emp. Form.:
C11H16ClN3O3
Mol. Mass.:
273.716
SMILES:
CC(C)Cn1c(N)c(C(=O)CCl)c(=O)n(C)c1=O
:
Substrate
Name:
OMFP Substrate
Synonyms:
3-O-methylfluorescein phosphate | OMFP
Type:
fluorescent substrate
Mol. Mass.:
358.43
Organism:
Description:
Residue:
3
NA