Target
Dual specificity protein phosphatase 1
Ligand
BDBM35452
Substrate
OMFP Substrate
Meas. Tech.
In vitro MKP-1 Phosphatase Dose Response SAR Support Assay
pH
7±n/a
Temperature
296.15±n/a K
IC50
>50000±n/a nM
Citation
 PubChem, PC In vitro MKP-1 Phosphatase Dose Response SAR Support Assay  PubChem Bioassay (2007)[AID] 
Target
Name:
Dual specificity protein phosphatase 1
Synonyms:
CL100 DUSP1 MAP kinase phosphatase 1 MKP1 Protein-tyrosine phosphatase CL100 | VH1
Type:
Protein phosphatase
Mol. Mass.:
39301.48
Organism:
Homo sapiens (Human)
Description:
gi_4758204
Residue:
367
  
Inhibitor
Name:
BDBM35452
Synonyms:
2,8-bis(trifluoromethyl)-4-quinolinecarboxylic acid 2,8-bis(trifluoromethyl)quinoline-4-carboxylic acid cid_169721
Type:
Small organic molecule
Emp. Form.:
C12H5F6NO2
Mol. Mass.:
309.164
SMILES:
OC(=O)c1cc(nc2c(cccc12)C(F)(F)F)C(F)(F)F
:
Substrate
Name:
OMFP Substrate
Synonyms:
3-O-methylfluorescein phosphate | OMFP
Type:
fluorescent substrate
Mol. Mass.:
358.43
Organism:
Description:
Residue:
3
NA