Target
Dual specificity protein phosphatase 1
Ligand
BDBM35458
Substrate
OMFP Substrate
Meas. Tech.
In vitro MKP-1 Phosphatase Dose Response SAR Support Assay
pH
7±n/a
Temperature
296.15±n/a K
IC50
>50000±n/a nM
Citation
 PubChem, PC In vitro MKP-1 Phosphatase Dose Response SAR Support Assay  PubChem Bioassay (2007)[AID] 
Target
Name:
Dual specificity protein phosphatase 1
Synonyms:
CL100 DUSP1 MAP kinase phosphatase 1 MKP1 Protein-tyrosine phosphatase CL100 | VH1
Type:
Protein phosphatase
Mol. Mass.:
39301.48
Organism:
Homo sapiens (Human)
Description:
gi_4758204
Residue:
367
  
Inhibitor
Name:
BDBM35458
Synonyms:
2-cyano-N-(cyclopropylmethylcarbamoyl)acetamide 2-cyano-N-[(cyclopropylmethylamino)-oxomethyl]acetamide cid_9547716
Type:
Small organic molecule
Emp. Form.:
C8H11N3O2
Mol. Mass.:
181.1918
SMILES:
O=C(CC#N)NC(=O)NCC1CC1
:
Substrate
Name:
OMFP Substrate
Synonyms:
3-O-methylfluorescein phosphate | OMFP
Type:
fluorescent substrate
Mol. Mass.:
358.43
Organism:
Description:
Residue:
3
NA