Target
Dual specificity protein phosphatase 1
Ligand
BDBM35459
Substrate
OMFP Substrate
Meas. Tech.
In vitro MKP-1 Phosphatase Dose Response SAR Support Assay
pH
7±n/a
Temperature
296.15±n/a K
IC50
>50000±n/a nM
Citation
 PubChem, PC In vitro MKP-1 Phosphatase Dose Response SAR Support Assay  PubChem Bioassay (2007)[AID] 
Target
Name:
Dual specificity protein phosphatase 1
Synonyms:
CL100 DUSP1 MAP kinase phosphatase 1 MKP1 Protein-tyrosine phosphatase CL100 | VH1
Type:
Protein phosphatase
Mol. Mass.:
39301.48
Organism:
Homo sapiens (Human)
Description:
gi_4758204
Residue:
367
  
Inhibitor
Name:
BDBM35459
Synonyms:
CC-PMLSC-DMA-P131 N'-(1-benzyl-3-methyl-2,6-dioxopyrimidin-4-yl)-N,N-dimethylmethanimidamide N,N-dimethyl-N'-[3-methyl-2,6-dioxo-1-(phenylmethyl)-4-pyrimidinyl]methanimidamide | cid_9547717
Type:
Small organic molecule
Emp. Form.:
C15H18N4O2
Mol. Mass.:
286.329
SMILES:
CN(C)\C=N\c1cc(=O)n(Cc2ccccc2)c(=O)n1C
:
Substrate
Name:
OMFP Substrate
Synonyms:
3-O-methylfluorescein phosphate | OMFP
Type:
fluorescent substrate
Mol. Mass.:
358.43
Organism:
Description:
Residue:
3
NA