Target
Dual specificity protein phosphatase 1
Ligand
BDBM35478
Substrate
OMFP Substrate
Meas. Tech.
In vitro MKP-1 Phosphatase Dose Response SAR Support Assay
pH
7±n/a
Temperature
296.15±n/a K
IC50
>50000±n/a nM
Citation
 PubChem, PC In vitro MKP-1 Phosphatase Dose Response SAR Support Assay  PubChem Bioassay (2007)[AID] 
Target
Name:
Dual specificity protein phosphatase 1
Synonyms:
CL100 DUSP1 MAP kinase phosphatase 1 MKP1 Protein-tyrosine phosphatase CL100 | VH1
Type:
Protein phosphatase
Mol. Mass.:
39301.48
Organism:
Homo sapiens (Human)
Description:
gi_4758204
Residue:
367
  
Inhibitor
Name:
BDBM35478
Synonyms:
2,8-bis(trifluoromethyl)-4-quinolinecarboxylic acid [2-[6-amino-1-methyl-2,4-dioxo-3-(phenylmethyl)-5-pyrimidinyl]-2-oxoethyl] ester CC-PMLSC-DMA-P159 [2-[6-azanyl-1-methyl-2,4-bis(oxidanylidene)-3-(phenylmethyl)pyrimidin-5-yl]-2-oxidanylidene-ethyl] 2,8-bis(trifluoromethyl)quinoline-4-carboxylate | cid_9547734
Type:
Small organic molecule
Emp. Form.:
C26H18F6N4O5
Mol. Mass.:
580.4353
SMILES:
Cn1c(N)c(C(=O)COC(=O)c2cc(nc3c(cccc23)C(F)(F)F)C(F)(F)F)c(=O)n(Cc2ccccc2)c1=O
:
Substrate
Name:
OMFP Substrate
Synonyms:
3-O-methylfluorescein phosphate | OMFP
Type:
fluorescent substrate
Mol. Mass.:
358.43
Organism:
Description:
Residue:
3
NA