Target
Cathepsin B
Ligand
BDBM35514
Substrate
Z-Arg-Arg-AMC
Meas. Tech.
Cathepsin B mixture HTS dose-response confirmation
pH
6.8±n/a
Temperature
296.15±n/a K
IC50
14196.4±n/a nM
Citation
 PubChem, PC Cathepsin B mixture HTS dose-response confirmation  PubChem Bioassay (2008)[AID] 
Target
Name:
Cathepsin B
Synonyms:
APP secretase CATB_HUMAN CTSB Cathepsin B light chain | Cathepsin B1
Type:
Enzyme
Mol. Mass.:
37819.69
Organism:
Homo sapiens (Human)
Description:
gi_63102437
Residue:
339
  
Inhibitor
Name:
BDBM35514
Synonyms:
2-[cyano-(4-methoxy-6-pyrrolidin-1-yl-1,3,5-triazin-2-yl)amino]acetamide 2-[cyano-(4-methoxy-6-pyrrolidino-s-triazin-2-yl)amino]acetamide MLS000045719 SMR000027676 | cid_714967
Type:
Small organic molecule
Emp. Form.:
C11H15N7O2
Mol. Mass.:
277.2825
SMILES:
COc1nc(nc(n1)N1CCCC1)N(CC(N)=O)C#N
:
Substrate
Name:
Z-Arg-Arg-AMC
Synonyms:
Benzyloxycarbonyl- L-arginyl- L-arginine- 4-methylcoumaryl-7-amide
Type:
fluorogenic substrate
Mol. Mass.:
358.43
Organism:
Description:
Residue:
3
NA