Target
Cathepsin B
Ligand
BDBM35516
Substrate
Z-Arg-Arg-AMC
Meas. Tech.
Cathepsin B mixture HTS dose-response confirmation
pH
6.8±n/a
Temperature
296.15±n/a K
IC50
22432.8±n/a nM
Citation
 PubChem, PC Cathepsin B mixture HTS dose-response confirmation  PubChem Bioassay (2008)[AID] 
Target
Name:
Cathepsin B
Synonyms:
APP secretase CATB_HUMAN CTSB Cathepsin B light chain | Cathepsin B1
Type:
Enzyme
Mol. Mass.:
37819.69
Organism:
Homo sapiens (Human)
Description:
gi_63102437
Residue:
339
  
Inhibitor
Name:
BDBM35516
Synonyms:
4-(1-benzyl-1H-benzimidazol-2-yl)-1,2,5-oxadiazol-3-amine 4-[1-(phenylmethyl)-2-benzimidazolyl]-1,2,5-oxadiazol-3-amine MLS000061627 [4-(1-benzylbenzimidazol-2-yl)furazan-3-yl]amine | cid_561320
Type:
Small organic molecule
Emp. Form.:
C16H13N5O
Mol. Mass.:
291.3073
SMILES:
Nc1nonc1-c1nc2ccccc2n1Cc1ccccc1
:
Substrate
Name:
Z-Arg-Arg-AMC
Synonyms:
Benzyloxycarbonyl- L-arginyl- L-arginine- 4-methylcoumaryl-7-amide
Type:
fluorogenic substrate
Mol. Mass.:
358.43
Organism:
Description:
Residue:
3
NA