Target
Cathepsin B
Ligand
BDBM35520
Substrate
Z-Arg-Arg-AMC
Meas. Tech.
Cathepsin B mixture HTS dose-response confirmation
pH
6.8±n/a
Temperature
296.15±n/a K
IC50
>50000±n/a nM
Citation
 PubChem, PC Cathepsin B mixture HTS dose-response confirmation  PubChem Bioassay (2008)[AID] 
Target
Name:
Cathepsin B
Synonyms:
APP secretase CATB_HUMAN CTSB Cathepsin B light chain | Cathepsin B1
Type:
Enzyme
Mol. Mass.:
37819.69
Organism:
Homo sapiens (Human)
Description:
gi_63102437
Residue:
339
  
Inhibitor
Name:
BDBM35520
Synonyms:
4-(4-morpholinyl)-6-(1-piperidinyl)-1,3,5-triazine-2-carbonitrile 4-morpholino-6-piperidino-s-triazine-2-carbonitrile SMR000081092 | cid_729563
Type:
Small organic molecule
Emp. Form.:
C13H18N6O
Mol. Mass.:
274.3216
SMILES:
N#Cc1nc(nc(n1)N1CCOCC1)N1CCCCC1
:
Substrate
Name:
Z-Arg-Arg-AMC
Synonyms:
Benzyloxycarbonyl- L-arginyl- L-arginine- 4-methylcoumaryl-7-amide
Type:
fluorogenic substrate
Mol. Mass.:
358.43
Organism:
Description:
Residue:
3
NA