Target
Aurora kinase A
Ligand
BDBM35656
Substrate
Kemptide
Meas. Tech.
Ki Determination
Ki
410±n/a nM
Citation
 Aronov, AMTang, QMartinez-Botella, GBemis, GWCao, JChen, GEwing, NPFord, PJGermann, UAGreen, JHale, MRJacobs, MJanetka, JWMaltais, FMarkland, WNamchuk, MNNanthakumar, SPoondru, SStraub, Jter Haar, EXie, X Structure-guided design of potent and selective pyrimidylpyrrole inhibitors of extracellular signal-regulated kinase (ERK) using conformational control. J Med Chem 52:6362-8 (2009)  
Target
Name:
Aurora kinase A
Synonyms:
AIK ARK1 AURKA AYK1 Aurora kinase A (AURA) Aurora kinase A (Aurora A) Aurora-related kinase 1 BTAK Breast-tumor-amplified kinase STK15 Serine/threonine kinase 15 Serine/threonine-protein kinase aurora A hARK1
Type:
Serine/threonine-protein kinase
Mol. Mass.:
45830.98
Organism:
Homo sapiens (Human)
Description:
O14965
Residue:
403
  
Inhibitor
Name:
BDBM35656
Synonyms:
erk000650 | pyrimidylpyrrole, 11d
Type:
Small organic molecule
Emp. Form.:
C25H23Cl2N5O2
Mol. Mass.:
496.388
SMILES:
Cc1cc(Cl)ccc1Nc1ncc(C)c(n1)-c1c[nH]c(c1)C(=O)N[C@H](CO)c1cccc(Cl)c1
:
Substrate
Name:
Kemptide
Synonyms:
Aurora Peptide Substrate
Type:
Peptide
Mol. Mass.:
773.92
Organism:
Description:
50 uM ATP as co-substrate.
Residue:
7
LRRASLG