Target
Beta-secretase 2
Ligand
BDBM50271174
Substrate
Meas. Tech.
BACE-2 Assay
Ki
16.0±n/a nM
Citation
 Scott, JDBlizzard, TAWalsh, SPCumming, JN C5-C6-carbocyclic fused iminothiadiazine dioxides as BACE inhibitors, compositions, and their use US Patent  US10329291 Publication Date 6/25/2019 
Target
Name:
Beta-secretase 2
Synonyms:
AEPLC ASP1 Asp 1 Aspartyl protease 1 BACE2_HUMAN Beta-secretase (BACE) Beta-secretase 2 (BACE-2) Beta-site APP-cleaving enzyme 2 Memapsin-1 beta-Secretase (BACE-2)
Type:
Protein
Mol. Mass.:
56171.20
Organism:
Homo sapiens (Human)
Description:
Q9Y5Z0
Residue:
518
  
Inhibitor
Name:
BDBM50271174
Synonyms:
CHEMBL4126480
Type:
Small organic molecule
Emp. Form.:
C19H21FN6O3S
Mol. Mass.:
432.472
SMILES:
[H][C@@]12CCC[C@@]1(NC(=N)N(C)S2(=O)=O)c1cc(NC(=O)c2cnc(C)cn2)ccc1F
: