Target
Histamine H1 receptor
Ligand
BDBM35928
Substrate
BDBM35938
Meas. Tech.
Radioligand Binding Assay
Temperature
298.15±n/a K
Ki
0.5±n/a nM
Comments
extracted
Citation
 Shah, JRMosier, PDRoth, BLKellogg, GEWestkaemper, RB Synthesis, structure-affinity relationships, and modeling of AMDA analogs at 5-HT2A and H1 receptors: structural factors contributing to selectivity. Bioorg Med Chem 17:6496-504 (2009)  
Target
Name:
Histamine H1 receptor
Synonyms:
H1R HISTAMINE H1 HRH1_HUMAN
Type:
G Protein-Coupled Receptor (GPCR)
Mol. Mass.:
55808.72
Organism:
Homo sapiens (Human)
Description:
Cell pellets from SK-N-MC cells transfected with human H1 receptor were used in binding assay.
Residue:
487
  
Inhibitor
Name:
BDBM35928
Synonyms:
3-(9,10-dihydroanthracen-9-yl)-N,N-dimethylpropan-1-amine CHEMBL346230 | [3-(9,10-Dihydro-anthracen-9-yl)-propyl]-dimethyl-amine
Type:
Small organic molecule
Emp. Form.:
C19H23N
Mol. Mass.:
265.3926
SMILES:
CN(C)CCCC1c2ccccc2Cc2ccccc12
:
Substrate
Name:
BDBM35938
Synonyms:
1-(p-chlorophenyl)-1-(2-pyridyl)-3-N,N-dimethylpropylamine 3-(p-chlorophenyl)-3-(2-pyridyl)-N,N-dimethylpropylamine CHEMBL505 CHLORPHENIRAMINE MALEATE Polaramine [3H]Chlorphenamine chlorophenylpyridamine clorfeniramina gamma-(4-chlorophenyl)-N,N-dimethyl-2-pyridinepropanamine | gamma-(4-chlorophenyl)-gamma-(2-pyridyl)propyldimethylamine
Type:
radiolabeled ligand
Emp. Form.:
C16H19ClN2
Mol. Mass.:
274.788
SMILES:
CN(C)CCC(c1ccc(Cl)cc1)c1ccccn1
: