Target
Carbonic anhydrase 2
Ligand
BDBM36002
Substrate
Meas. Tech.
SPR biosensor assay Biacore T100
pH
7.4±0
Temperature
298.15±0 K
Kd
817±0 nM
KOFF
134000 s-1
KON
0.1091 M-1s-1
Citation
 Navratilova, IHopkins, AL Fragment Screening by Surface Plasmon Resonance ACS Med Chem Lett 1:44-8 (2010)   
Target
Name:
Carbonic anhydrase 2
Synonyms:
CA2 Carbonic anhydrase Carbonic anhydrase II Carbonic anhydrase II (CA-II)
Type:
Enzyme Catalytic Domain
Mol. Mass.:
29115.93
Organism:
Bos taurus
Description:
Residue:
260
  
Inhibitor
Name:
BDBM36002
Synonyms:
2,3-dihydro-1,4-benzodioxine-6-sulfonamide | SPR_6
Type:
Small organic molecule
Emp. Form.:
C8H9NO4S
Mol. Mass.:
215.226
SMILES:
NS(=O)(=O)c1ccc2OCCOc2c1
: